{"text_format":"1","workbook":"xlsx","n_sheets":4,"sheets":["Claim Adjustment Form","Date of Birth Ranges","Admin","Summary (READ ONLY)"],"not_rendered":{"charts":0,"images":1,"macros":1,"external_links":0,"defined_names":2,"comments":0,"pivot_tables":0},"unopened":[],"bounds":{"document_bytes":16777216,"sheet_cells":100000,"rows_first":2000,"rows_last":500,"rows_between":2000,"halvings":0,"cell_chars":16384,"cell_head_chars":4096},"cells_cut":0,"cells_raw":0,"read":"whole","date_system":"1900"}

{"sheet":"Claim Adjustment Form","index":0,"n_rows":221,"n_cols":36,"rows_kept":221,"cut":false,"hidden":false,"merged":[[191,5,191,7],[191,8,191,9],[191,10,191,11],[191,12,191,13],[212,5,212,7],[212,8,212,10],[212,11,212,13],[213,5,213,7],[213,8,213,10],[213,11,213,13],[210,5,210,7],[210,8,210,9],[210,10,210,11],[210,12,210,13],[211,5,211,7],[211,8,211,9],[211,10,211,11],[211,12,211,13],[206,2,206,11],[206,13,206,19],[208,2,208,19],[197,2,197,3],[197,4,197,5],[197,6,197,11],[166,2,166,11],[166,13,166,19],[168,2,168,19],[171,2,171,4],[171,5,171,7],[171,8,171,9],[171,10,171,11],[171,12,171,13],[172,5,172,7],[172,8,172,10],[172,11,172,13],[157,2,157,3],[157,4,157,5],[157,6,157,11],[157,13,157,19],[159,2,159,19],[160,2,161,19],[164,5,164,10],[164,11,164,17],[164,18,164,19],[151,12,151,13],[137,2,137,3],[137,4,137,5],[137,6,137,11],[137,13,137,19],[139,2,139,19],[140,2,141,19],[144,5,144,10],[144,11,144,17],[144,18,144,19],[146,2,146,11],[146,13,146,19],[148,2,148,19],[99,2,99,19],[100,2,101,19],[97,2,97,3],[97,4,97,5],[113,5,113,7],[120,2,121,19],[124,5,124,10],[124,11,124,17],[124,18,124,19],[106,2,106,11],[106,13,106,19],[108,2,108,19],[130,12,130,13],[110,2,110,4],[110,5,110,7],[110,8,110,9],[110,10,110,11],[110,12,110,13],[126,2,126,11],[126,13,126,19],[128,2,128,19],[90,2,90,4],[90,5,90,7],[90,8,90,9],[90,10,90,11],[90,12,90,13],[84,11,84,17],[72,14,72,17],[73,14,73,17],[94,11,95,13],[31,10,31,11],[44,5,44,10],[44,11,44,17],[46,2,46,11],[48,2,48,19],[72,11,72,13],[73,5,73,7],[73,8,73,10],[73,11,73,13],[64,5,64,10],[64,11,64,17],[64,18,64,19],[66,2,66,11],[66,13,66,19],[68,2,68,19],[50,5,50,7],[50,8,50,9],[50,10,50,11],[50,12,50,13],[24,18,24,19],[28,2,28,19],[32,18,32,19],[32,14,32,17],[33,14,33,17],[33,18,33,19],[33,2,33,4],[26,2,26,11],[26,13,26,19],[30,12,30,13],[31,12,31,13],[32,5,32,7],[33,5,33,7],[32,8,32,10],[33,8,33,10],[32,11,32,13],[33,11,33,13],[30,2,30,4],[31,2,31,4],[30,8,30,9],[31,8,31,9],[30,5,30,7],[31,5,31,7],[30,10,30,11],[19,14,19,15],[3,3,4,19],[19,18,19,19],[7,5,7,12],[7,17,7,19],[11,6,11,12],[11,17,11,19],[13,4,13,12],[13,17,13,19],[15,2,15,19],[17,3,17,18],[19,2,19,8],[19,9,19,12],[16,3,16,18],[5,7,5,15],[21,2,21,19],[24,5,24,10],[24,11,24,17],[32,2,32,4],[84,18,84,19],[84,5,84,10],[86,2,86,11],[86,13,86,19],[88,2,88,19],[72,18,72,19],[59,2,59,19],[60,2,61,19],[51,2,51,4],[51,5,51,7],[51,8,51,9],[51,10,51,11],[51,12,51,13],[52,5,52,7],[52,8,52,10],[52,11,52,13],[53,5,53,7],[53,8,53,10],[53,11,53,13],[50,2,50,4],[30,1,35,1],[44,18,44,19],[40,2,41,19],[39,2,39,19],[53,14,53,17],[54,11,55,13],[57,2,57,3],[34,11,35,13],[34,2,35,4],[37,4,37,5],[37,13,37,19],[37,6,37,11],[37,2,37,3],[57,4,57,5],[57,6,57,11],[57,13,57,19],[46,13,46,19],[52,2,52,4],[52,14,52,17],[52,18,52,19],[53,2,53,4],[50,1,55,1],[53,18,53,19],[54,2,55,4],[70,1,75,1],[72,2,72,4],[73,2,73,4],[74,2,75,4],[74,11,75,13],[70,2,70,4],[70,5,70,7],[70,8,70,9],[80,2,81,19],[73,18,73,19],[77,2,77,3],[77,4,77,5],[77,6,77,11],[77,13,77,19],[79,2,79,19],[70,10,70,11],[70,12,70,13],[71,2,71,4],[71,5,71,7],[71,8,71,9],[71,10,71,11],[71,12,71,13],[72,5,72,7],[72,8,72,10],[90,1,95,1],[92,2,92,4],[92,14,92,17],[92,18,92,19],[93,2,93,4],[92,5,92,7],[104,5,104,10],[104,11,104,17],[104,18,104,19],[97,6,97,11],[97,13,97,19],[91,2,91,4],[91,5,91,7],[91,8,91,9],[91,10,91,11],[91,12,91,13],[92,8,92,10],[92,11,92,13],[93,5,93,7],[93,8,93,10],[93,11,93,13],[93,14,93,17],[93,18,93,19],[94,2,95,4],[110,1,115,1],[112,2,112,4],[112,14,112,17],[112,18,112,19],[114,2,115,4],[114,11,115,13],[113,8,113,10],[113,11,113,13],[119,2,119,19],[117,2,117,3],[117,4,117,5],[117,6,117,11],[117,13,117,19],[113,2,113,4],[113,14,113,17],[113,18,113,19],[111,2,111,4],[111,5,111,7],[111,8,111,9],[111,10,111,11],[111,12,111,13],[112,5,112,7],[112,8,112,10],[112,11,112,13],[130,1,135,1],[132,2,132,4],[132,14,132,17],[132,18,132,19],[133,2,133,4],[133,14,133,17],[133,18,133,19],[134,2,135,4],[134,11,135,13],[132,5,132,7],[132,8,132,10],[132,11,132,13],[133,5,133,7],[133,8,133,10],[133,11,133,13],[131,2,131,4],[131,5,131,7],[131,8,131,9],[131,10,131,11],[131,12,131,13],[130,2,130,4],[130,5,130,7],[130,8,130,9],[130,10,130,11],[150,1,155,1],[152,2,152,4],[152,14,152,17],[152,18,152,19],[153,2,153,4],[153,14,153,17],[153,18,153,19],[154,2,155,4],[154,11,155,13],[152,5,152,7],[152,8,152,10],[152,11,152,13],[153,5,153,7],[153,8,153,10],[153,11,153,13],[150,2,150,4],[150,5,150,7],[150,8,150,9],[150,10,150,11],[150,12,150,13],[151,2,151,4],[151,5,151,7],[151,8,151,9],[151,10,151,11],[170,1,175,1],[172,2,172,4],[172,14,172,17],[172,18,172,19],[173,2,173,4],[173,14,173,17],[173,18,173,19],[174,2,175,4],[174,11,175,13],[170,2,170,4],[170,5,170,7],[170,8,170,9],[170,10,170,11],[170,12,170,13],[173,5,173,7],[173,8,173,10],[173,11,173,13],[177,2,177,3],[177,4,177,5],[177,6,177,11],[177,13,177,19],[179,2,179,19],[180,2,181,19],[184,5,184,10],[184,11,184,17],[184,18,184,19],[186,2,186,11],[186,13,186,19],[188,2,188,19],[190,1,195,1],[192,2,192,4],[192,14,192,17],[192,18,192,19],[193,2,193,4],[193,14,193,17],[193,18,193,19],[194,2,195,4],[194,11,195,13],[192,5,192,7],[192,8,192,10],[192,11,192,13],[193,5,193,7],[193,8,193,10],[193,11,193,13],[190,2,190,4],[190,5,190,7],[190,8,190,9],[190,10,190,11],[190,12,190,13],[191,2,191,4],[197,13,197,19],[199,2,199,19],[200,2,201,19],[204,5,204,10],[204,11,204,17],[204,18,204,19],[210,1,215,1],[212,2,212,4],[212,14,212,17],[212,18,212,19],[213,2,213,4],[210,2,210,4],[211,2,211,4],[220,2,221,19],[213,14,213,17],[213,18,213,19],[214,2,215,4],[214,11,215,13],[217,2,217,3],[217,4,217,5],[217,6,217,11],[217,13,217,19],[219,2,219,19]]}
[]
[]
[null,null,null,null,null,null,null,null,null,null,null,null,null,null,null,null,null,null,null,null,null,null,null,null,{"$f":"TODAY()","v":"2026-01-09"},"Adjustment Reason List","Adjustment Resent Comments","Gender","SEN","Ethinicity","Yes/No list","Offer Type","Term","Year","Hours"]
[null,null,null,"FE FUNDING CLAIM FORM ADJUSTMENT SHEET (CF4)",null,null,null,null,null,null,null,null,null,null,null,null,null,null,null,null,null,null,null,null,null,"New Starter/Adding a child to a claim","As the child has attended and claimed funding at another setting this term, funding can only be moved at half term or at the start of next term unless under exceptional circumstances.  \nExceptional circumstances must be agreed by the funding team before a claim is made.\nPlease be aware if the child has claimed on a different offer type previously, the hours may have to be restricted.","M","N","ABAN","Yes","Term Time","Spring Term",2024,15,30]
[null,null,null,null,null,null,null,null,null,null,null,null,null,null,null,null,null,null,null,null,null,null,null,null,null,"Child leaving/not claiming for the term","The leaving date should be the last day they actually attended for funded hours.  \nThere can be no notice period for any funded hours.  \nIf you have a signed PPA and the child has attended for funded hours this term, the funding will continue until half term (If they left before half term) or the end of term (if they left during the second half of term)","F","K","AIND","No","Stretched","Summer Term",2025,14.75,29.75]
[null,null,null,null,null,null,null,"Please upload completed CF4 forms via AnyComms (choose FFE Funding for File Type)",null,null,null,null,null,null,null,null,null,null,null,null,null,null,null,null,null,"Change of hours claimed","Please put the full amount of hours you are now claiming in the relevant fields and the original hours you claimed in the Previous hours fields.  If they have used the new hours at another setting this term your funding may be restricted.",null,"E","AOTH",null,null,"Autumn Term",2026,14.5,29.5]
[null,null,null,null,null,null,null,null,null,null,null,null,null,null,null,null,null,null,null,null,null,null,null,null,null,"Change to childs personal details","Please complete the child's details and state in the additional comments field what has changed.",null,null,"APKN",null,null,null,2027,14.25,29.25]
[null,null,"Setting Name",null,null,null,null,null,null,null,null,null,null,null,"Funding URN",null,null,null,null,null,null,null,null,null,null,"Claiming for DAF Funding","Please ensure you have uploaded a copy of their Disability Living Allowance agreement via AnyComms",null,null,"BAFR",null,null,null,null,14,29]
[null,null,null,null,null,null,null,null,null,null,null,null,null,null,null,null,null,null,null,null,null,null,null,null,null,null,"As the child has not attended and claimed funding at another setting this term, funding can be claimed from the date from when they start with you assuming they are eligible to do so for this term.  \nPlease be aware if the child has claimed on a different offer type previously, the hours may have to be restricted.",null,null,"BCRB",null,null,null,null,13.75,28.75]
[null,null,"By completing this form you are confirming that all information provided is accurate and a true reflection of your service provision.",null,null,null,null,null,null,null,null,null,null,null,null,null,null,null,null,null,null,null,null,null,null,null,null,null,null,"BOTH",null,null,null,null,13.5,28.5]
{"$rows_left_out":212}
{"sheet":"Date of Birth Ranges","index":1,"n_rows":16,"n_cols":21,"rows_kept":16,"cut":false,"hidden":false,"merged":[]}
[]
[null,"The valid Date of Birth Age ranges for each term are as follows"]
[]
[]
[null,"Spring Term 2024","Dates of birth must be between ","2019-01-01","and","2021-12-31",null,"3&4 Years Olds between","2019-01-01","and","2020-12-31",null,"2 Years Olds between","2021-01-01","and","2021-12-31"]
[null,"Summer Term 2024","Dates of birth must be between ","2019-04-01","and","2022-03-31",null,"3&4 Years Olds between","2019-04-01","and","2021-03-31",null,"2 Years Olds between","2021-04-01","and","2022-03-31"]
[null,"Autumn Term 2024","Dates of birth must be between ","2019-09-01","and","2023-12-31",null,"3&4 Years Olds between","2019-09-01","and","2021-08-31",null,"2 Years Olds between","2021-09-01","and","2022-08-31",null,"Under 2s between","2022-09-01","and","2023-12-31"]
[null,"Spring Term 2025","Dates of birth must be between ","2020-01-01","and","2022-12-31",null,"3&4 Years Olds between","2020-01-01","and","2021-12-31",null,"2 Years Olds between","2022-01-01","and","2022-12-31",null,"Under 2s between","2023-01-01","and","2024-03-31"]
[null,"Summer Term 2025","Dates of birth must be between ","2020-04-01","and","2024-06-30",null,"3&4 Years Olds between","2020-04-01","and","2022-03-31",null,"2 Years Olds between","2022-04-01","and","2023-03-31",null,"Under 2s between","2023-04-01","and","2024-06-30"]
[null,"Autumn Term 2025","Dates of birth must be between ","2020-09-01","and","2024-12-31",null,"3&4 Years Olds between","2020-09-01","and","2022-08-31",null,"2 Years Olds between","2022-09-01","and","2023-08-31",null,"Under 2s between","2023-09-01","and","2024-12-31"]
{"$rows_left_out":7}
{"sheet":"Admin","index":2,"n_rows":13,"n_cols":11,"rows_kept":13,"cut":false,"hidden":true,"merged":[]}
[null,null,null,"3&4",null,2,null,"Under 2",null,null,"Date Validation"]
["Spring Term 2024","2019-01-01","2021-12-31","2019-01-01","2020-12-31","2021-01-01","2021-12-31",null,null,"2024-01-01","2024-03-31"]
["Summer Term 2024","2019-04-01","2022-03-31","2019-04-01","2021-03-31","2021-04-01","2022-03-31",null,null,"2024-04-01","2024-08-31"]
["Autumn Term 2024","2019-09-01","2023-12-31","2019-09-01","2021-08-31","2021-09-01","2022-08-31","2022-09-01","2023-12-31","2024-09-01","2024-12-31"]
["Spring Term 2025","2020-01-01","2022-12-31","2020-01-01","2021-12-31","2022-01-01","2022-12-31","2023-01-01","2024-03-31","2025-01-01","2025-03-31"]
["Summer Term 2025","2020-04-01","2024-06-30","2020-04-01","2022-03-31","2022-04-01","2023-03-31","2023-04-01","2024-06-30","2025-04-01","2025-08-31"]
["Autumn Term 2025","2020-09-01","2024-12-31","2020-09-01","2022-08-31","2022-09-01","2023-08-31","2023-09-01","2024-12-31","2025-09-01",{"$f":"TODAY()","v":"2026-01-09"}]
["Spring Term 2026","2021-01-01","2023-12-31","2021-01-01","2022-12-31","2023-01-01","2023-12-31","2024-01-01","2025-03-31","2026-01-01"]
["Summer Term 2026","2021-04-01","2025-06-30","2021-04-01","2023-03-31","2023-04-01","2024-03-31","2024-04-01","2025-06-30","2026-04-01"]
["Autumn Term 2026","2021-09-01","2025-12-31","2021-09-01","2023-08-31","2023-09-01","2024-08-31","2024-09-01","2025-12-31","2026-09-01"]
{"$rows_left_out":4}
{"sheet":"Summary (READ ONLY)","index":3,"n_rows":19,"n_cols":37,"rows_kept":19,"cut":false,"hidden":false,"merged":[[5,2,5,6],[5,8,5,9],[2,2,2,11],[2,13,2,14],[3,2,3,5],[3,7,3,11],[3,13,3,16]]}
[null,"Claim Adjustment Form Summary"]
[]
[null,"Setting Name",{"$f":"'Claim Adjustment Form'!F8","v":0},null,null,null,null,null,null,null,null,null,"Funding URN",{"$f":"'Claim Adjustment Form'!R8","v":0},null,"Date",{"$f":"'Claim Adjustment Form'!R12","v":"00:00:00"}]
[null,"Name Person completing",{"$f":"'Claim Adjustment Form'!G12","v":0},null,null,null,"Email",{"$f":"'Claim Adjustment Form'!E14","v":0},null,null,null,null,"Telephone",{"$f":"'Claim Adjustment Form'!R14","v":0}]
[]
[null,"The term the adjustment is for",{"$f":"'Claim Adjustment Form'!J20","v":0},null,null,null,null,"Year",{"$f":"'Claim Adjustment Form'!S20","v":0}]
[]
[]
[null,"Reason for adjustment","Date for adjustment","attended another setting","Legal Surname","Legal forename","middle name","preferred surname","preferred forename","DOB","Gender","Ethnicity","SEN","Armed Forces","DLA","Age","Offer Type","Universal","Extended","Expanded","Weeks","Residual","OLD Offer Type","OLD Universal","OLD Extended","OLD Expanded","OLD Weeks","OLD Residual","Eligibility code","Flat number","house number","street","local area","town","postcode","code checked?","Comments"]
[1,{"$f":"IF(VLOOKUP($A10,'Claim Adjustment Form'!A:T,6,FALSE)=\"\",\"\",(VLOOKUP($A10,'Claim Adjustment Form'!A:T,6,FALSE)))","v":""},{"$f":"IF(VLOOKUP($A10,'Claim Adjustment Form'!A:T,19,FALSE)=\"\",\"\",(VLOOKUP($A10,'Claim Adjustment Form'!A:T,19,FALSE)))","v":""},{"$f":"IF(VLOOKUP($A10&\"a\",'Claim Adjustment Form'!A:T,13,FALSE)=\"\",\"\",(VLOOKUP($A10&\"a\",'Claim Adjustment Form'!A:T,13,FALSE)))","v":""},{"$f":"IF(VLOOKUP($A10&\"b\",'Claim Adjustment Form'!A:T,3,FALSE)=\"\",\"\",(VLOOKUP($A10&\"b\",'Claim Adjustment Form'!A:T,3,FALSE)))","v":""},{"$f":"IF(VLOOKUP($A10&\"b\",'Claim Adjustment Form'!A:T,6,FALSE)=\"\",\"\",(VLOOKUP($A10&\"b\",'Claim Adjustment Form'!A:T,6,FALSE)))","v":""},{"$f":"IF(VLOOKUP($A10&\"b\",'Claim Adjustment Form'!A:T,9,FALSE)=\"\",\"\",(VLOOKUP($A10&\"b\",'Claim Adjustment Form'!A:T,9,FALSE)))","v":""},{"$f":"IF(VLOOKUP($A10&\"b\",'Claim Adjustment Form'!A:T,11,FALSE)=\"\",\"\",(VLOOKUP($A10&\"b\",'Claim Adjustment Form'!A:T,11,FALSE)))","v":""},{"$f":"IF(VLOOKUP($A10&\"b\",'Claim Adjustment Form'!A:T,13,FALSE)=\"\",\"\",(VLOOKUP($A10&\"b\",'Claim Adjustment Form'!A:T,13,FALSE)))","v":""},{"$f":"IF(VLOOKUP($A10&\"b\",'Claim Adjustment Form'!A:T,15,FALSE)=\"\",\"\",(VLOOKUP($A10&\"b\",'Claim Adjustment Form'!A:T,15,FALSE)))","v":""},{"$f":"IF(VLOOKUP($A10&\"b\",'Claim Adjustment Form'!A:T,16,FALSE)=\"\",\"\",(VLOOKUP($A10&\"b\",'Claim Adjustment Form'!A:T,16,FALSE)))","v":""},{"$f":"IF(VLOOKUP($A10&\"b\",'Claim Adjustment Form'!A:T,17,FALSE)=\"\",\"\",(VLOOKUP($A10&\"b\",'Claim Adjustment Form'!A:T,17,FALSE)))","v":""},{"$f":"IF(VLOOKUP($A10&\"b\",'Claim Adjustment Form'!A:T,18,FALSE)=\"\",\"\",(VLOOKUP($A10&\"b\",'Claim Adjustment Form'!A:T,18,FALSE)))","v":""},{"$f":"IF(VLOOKUP($A10&\"b\",'Claim Adjustment Form'!A:T,19,FALSE)=\"\",\"\",(VLOOKUP($A10&\"b\",'Claim Adjustment Form'!A:T,19,FALSE)))","v":""},{"$f":"IF(VLOOKUP($A10&\"b\",'Claim Adjustment Form'!A:T,20,FALSE)=\"\",\"\",(VLOOKUP($A10&\"b\",'Claim Adjustment Form'!A:T,20,FALSE)))","v":""},{"$f":"IF(VLOOKUP($A10&\"c\",'Claim Adjustment Form'!A:AG,33,FALSE)=\"\",\"\",(VLOOKUP($A10&\"c\",'Claim Adjustment Form'!A:AG,33,FALSE)))","v":""},{"$f":"IF(VLOOKUP($A10&\"d\",'Claim Adjustment Form'!A:F,6,FALSE)=\"\",\"\",(VLOOKUP($A10&\"d\",'Claim Adjustment Form'!A:F,6,FALSE)))","v":""},{"$f":"IF(VLOOKUP($A10&\"d\",'Claim Adjustment Form'!A:T,7,FALSE)=\"\",\"\",(VLOOKUP($A10&\"d\",'Claim Adjustment Form'!A:T,7,FALSE)))","v":""},{"$f":"IF(VLOOKUP($A10&\"d\",'Claim Adjustment Form'!A:T,8,FALSE)=\"\",\"\",(VLOOKUP($A10&\"d\",'Claim Adjustment Form'!A:T,8,FALSE)))","v":""},{"$f":"IF(VLOOKUP($A10&\"d\",'Claim Adjustment Form'!A:T,9,FALSE)=\"\",\"\",(VLOOKUP($A10&\"d\",'Claim Adjustment Form'!A:T,9,FALSE)))","v":""},{"$f":"IF(VLOOKUP($A10&\"d\",'Claim Adjustment Form'!A:T,10,FALSE)=\"\",\"\",(VLOOKUP($A10&\"d\",'Claim Adjustment Form'!A:T,10,FALSE)))","v":""},{"$f":"IF(VLOOKUP($A10&\"d\",'Claim Adjustment Form'!A:T,11,FALSE)=\"\",\"\",(VLOOKUP($A10&\"d\",'Claim Adjustment Form'!A:T,11,FALSE)))","v":""},{"$f":"IF(VLOOKUP($A10&\"d\",'Claim Adjustment Form'!A:T,15,FALSE)=\"\",\"\",(VLOOKUP($A10&\"d\",'Claim Adjustment Form'!A:T,15,FALSE)))","v":""},{"$f":"IF(VLOOKUP($A10&\"d\",'Claim Adjustment Form'!A:T,16,FALSE)=\"\",\"\",(VLOOKUP($A10&\"d\",'Claim Adjustment Form'!A:T,16,FALSE)))","v":""},{"$f":"IF(VLOOKUP($A10&\"d\",'Claim Adjustment Form'!A:T,17,FALSE)=\"\",\"\",(VLOOKUP($A10&\"d\",'Claim Adjustment Form'!A:T,17,FALSE)))","v":""},{"$f":"IF(VLOOKUP($A10&\"d\",'Claim Adjustment Form'!A:T,18,FALSE)=\"\",\"\",(VLOOKUP($A10&\"d\",'Claim Adjustment Form'!A:T,18,FALSE)))","v":""},{"$f":"IF(VLOOKUP($A10&\"d\",'Claim Adjustment Form'!A:T,19,FALSE)=\"\",\"\",(VLOOKUP($A10&\"d\",'Claim Adjustment Form'!A:T,19,FALSE)))","v":""},{"$f":"IF(VLOOKUP($A10&\"d\",'Claim Adjustment Form'!A:T,20,FALSE)=\"\",\"\",(VLOOKUP($A10&\"d\",'Claim Adjustment Form'!A:T,20,FALSE)))","v":""},{"$f":"IF(VLOOKUP($A10&\"e\",'Claim Adjustment Form'!A:T,5,FALSE)=\"\",\"\",(VLOOKUP($A10&\"e\",'Claim Adjustment Form'!A:T,5,FALSE)))","v":""},{"$f":"IF(VLOOKUP($A10&\"c\",'Claim Adjustment Form'!A:T,3,FALSE)=\"\",\"\",(VLOOKUP($A10&\"c\",'Claim Adjustment Form'!A:T,3,FALSE)))","v":""},{"$f":"IF(VLOOKUP($A10&\"c\",'Claim Adjustment Form'!A:T,6,FALSE)=\"\",\"\",(VLOOKUP($A10&\"c\",'Claim Adjustment Form'!A:T,6,FALSE)))","v":""},{"$f":"IF(VLOOKUP($A10&\"c\",'Claim Adjustment Form'!A:T,9,FALSE)=\"\",\"\",(VLOOKUP($A10&\"c\",'Claim Adjustment Form'!A:T,9,FALSE)))","v":""},{"$f":"IF(VLOOKUP($A10&\"c\",'Claim Adjustment Form'!A:T,12,FALSE)=\"\",\"\",(VLOOKUP($A10&\"c\",'Claim Adjustment Form'!A:T,12,FALSE)))","v":""},{"$f":"IF(VLOOKUP($A10&\"c\",'Claim Adjustment Form'!A:T,15,FALSE)=\"\",\"\",(VLOOKUP($A10&\"c\",'Claim Adjustment Form'!A:T,15,FALSE)))","v":""},{"$f":"IF(VLOOKUP($A10&\"c\",'Claim Adjustment Form'!A:T,19,FALSE)=\"\",\"\",(VLOOKUP($A10&\"c\",'Claim Adjustment Form'!A:T,19,FALSE)))","v":""},{"$f":"IF(VLOOKUP($A10&\"e\",'Claim Adjustment Form'!A:T,13,FALSE)=\"\",\"\",(VLOOKUP($A10&\"e\",'Claim Adjustment Form'!A:T,13,FALSE)))","v":""},{"$f":"IF(VLOOKUP($A10&\"f\",'Claim Adjustment Form'!A:T,3,FALSE)=\"\",\"\",(VLOOKUP($A10&\"f\",'Claim Adjustment Form'!A:T,3,FALSE)))","v":""}]
{"$rows_left_out":9}